{"text_format":"1","workbook":"xlsx","n_sheets":21,"sheets":["Input","Loan Details","Applicant 1","Applicant 2","Applicant 3","Applicant 4","Household Expenditure","Summary Calculations","Version control","Stress Rates","CostOfLiving","Rates","Rates_upd","Tax Applicant 1","Tax Applicant 2","Tax Applicant 3","Tax Applicant 4","Tax Rates","1 Net Monthly Income","2 Existing Mortgage Commitments","3 Revolving Credit Commitments"],"not_rendered":{"charts":0,"images":5,"macros":1,"external_links":4,"defined_names":67,"comments":1,"pivot_tables":0},"unopened":[],"bounds":{"document_bytes":16777216,"sheet_cells":100000,"rows_first":2000,"rows_last":500,"rows_between":2000,"halvings":0,"cell_chars":16384,"cell_head_chars":4096},"cells_cut":0,"cells_raw":0,"read":"whole","date_system":"1900"}

{"sheet":"Input","index":0,"n_rows":93,"n_cols":18,"rows_kept":93,"cut":false,"hidden":false,"merged":[[58,1,58,9],[1,1,1,9],[3,1,3,9],[21,1,21,9],[22,6,22,9],[42,1,42,9],[43,6,43,9],[51,1,51,9],[52,6,52,9],[52,2,52,3],[43,2,43,3],[22,2,22,3],[90,1,90,9],[59,6,59,9],[65,1,65,9],[66,6,66,9],[86,1,86,9],[66,2,66,3],[59,2,59,3]]}
[]
[null,"Mortgage How Much We Will Lend Calculator",null,null,null,null,null,null,null,null,{"$f":"IF(D6=2,N8,M8)","v":9},null,{"$f":"COUNTA(D6,D8,D10,D12,D14,D18,D20,H8,IF(D10=35,1,H10),IF(D18=\"Yes\",1,IF(D12=\"Yes\",H12,I12)),IF(D12=\"Yes\",1,IF(D18=\"Yes\",H18,I18)),H16)","v":1},{"$f":"COUNTA(D6,D8,D10,D12,D14,D18,D20,H8,IF(D10=35,1,H10),IF(D18=\"Yes\",1,IF(D12=\"Yes\",H12,I12)),IF(D12=\"Yes\",1,IF(D18=\"Yes\",H18,I18)),H16,H20)","v":2},null,null,null,"Broker"]
[null,null,null,null,null,null,null,null,null,null,null,null,{"$f":"COUNTA(D46,D55,D62,IF(D46=\"Yes\",D48,E48),IF(D46=\"Yes\",D50,E50),IF(D55=\"Yes\",D57,E57),IF(D62=\"Yes\",D64,E64))","v":3},{"$f":"COUNTA(D46,D55,D62,IF(D46=\"Yes\",D48,E48),IF(D46=\"Yes\",D50,E50),IF(D55=\"Yes\",D57,E57),IF(D62=\"Yes\",D64,E64))+COUNTA(H46,H55,H62,IF(H46=\"Yes\",H48,I48),IF(H46=\"Yes\",H50,I50),IF(H55=\"Yes\",H57,I57),IF(H62=\"Yes\",H64,I64))","v":6}]
[null,"Customer & Loan Details",null,null,null,null,null,null,null,null,null,null,{"$f":"COUNTA(D69,D73,D77,D83,D85)","v":5},{"$f":"COUNTA(D69,D73,D77,D83,D85)+COUNTA(H69,H73,H77,H83,H85)","v":10}]
[null,null,null,null,null,null,null,null,null,null,null,null,{"$f":"COUNTA(D89,H89)","v":2},{"$f":"COUNTA(D89,H89)","v":2}]
[null,null,"Number of Applicants",null,null,null,"Customer Name",null,null,null,null,null,{"$f":"SUM(M2:M5)","v":11},{"$f":"SUM(N2:N5)","v":20}]
[null,null,null,null,null,null,null,null,null,null,null,null,{"$f":"10+IF(D12=\"Yes\",1,0)+IF(D18=\"Yes\",1,0)+3+SUM(IF(D46=\"Yes\",2,0),IF(D55=\"Yes\",1,0),IF(D62=\"Yes\",1,0))+5+2","v":20},{"$f":"11+IF(D12=\"Yes\",1,0)+IF(D18=\"Yes\",1,0)+6+SUM(IF(D46=\"Yes\",2,0),IF(D55=\"Yes\",1,0),IF(D62=\"Yes\",1,0),IF(H46=\"Yes\",2,0),IF(H55=\"Yes\",1,0),IF(H62=\"Yes\",1,0))+10+2","v":29}]
[null,null,"Loan Purpose",null,null,null,"Loan Amount",null,null,null,null,null,{"$f":"M7-M6","v":9},{"$f":"N7-N6","v":9}]
[]
[null,null,"Term Years",null,null,null,{"$f":"IF($D$10=35,\"\",\"Term Months\")","v":"Term Months"}]
{"$rows_left_out":84}
{"sheet":"Loan Details","index":1,"n_rows":14,"n_cols":12,"rows_kept":14,"cut":false,"hidden":false,"merged":[[2,1,2,13]]}
[]
[]
[null,"Loan Details"]
[]
[null,null,"Number of Applicants ",{"$f":"Input!D6","v":0},null,null,"Channel","Broker"]
[]
[null,null,"Loan Purpose",{"$f":"Input!D8","v":0},null,null,"Purchase Price",{"$f":"Input!D14","v":0},null,null,"LTV",{"$f":"IFERROR(H8/H7,0)","v":0}]
[null,null,"Term Years",{"$f":"Input!D10","v":0},null,null,"Loan Amount",{"$f":"Input!H8","v":0}]
[null,null,"Term Months",{"$f":"Input!H10","v":0}]
[null,null,null,null,null,null,"Product",{"$f":"Input!H14","v":0}]
{"$rows_left_out":5}
{"sheet":"Applicant 1","index":2,"n_rows":131,"n_cols":9,"rows_kept":131,"cut":false,"hidden":false,"merged":[[125,1,125,9],[57,1,57,9],[2,1,2,9],[8,1,8,9],[35,1,35,9],[94,1,94,9],[58,2,58,8],[64,2,64,8],[70,2,70,8],[75,2,75,8],[81,2,81,8]]}
[{"$f":"'Loan Details'!H5","v":"Broker"}]
[]
[null,"Loan Details"]
[]
[null,null,"Date of Birth (YYYY-MM-DD)",{"$f":"Input!D20","v":"1990-01-01"},null,null,"Age",{"$f":"IF(D5=\"\",\"Input DOB\",DATEDIF(D5,TODAY(),\"Y\"))","v":31}]
[null,null,"Estimate Retirement Age",68]
[]
[]
[null,"Employment Income"]
[]
{"$rows_left_out":122}
{"sheet":"Applicant 2","index":3,"n_rows":131,"n_cols":9,"rows_kept":131,"cut":false,"hidden":true,"merged":[[2,1,2,9],[75,2,75,8],[81,2,81,8],[94,1,94,9],[125,1,125,9],[8,1,8,9],[35,1,35,9],[58,2,58,8],[64,2,64,8],[70,2,70,8],[57,1,57,9],[10,3,10,4]]}
[{"$f":"'Loan Details'!H5","v":"Broker"}]
[]
[null,"Loan Details"]
[]
[null,null,"Date of Birth (YYYY-MM-DD)",null,null,null,"Age",{"$f":"IF(D5=\"\",\"Input DOB\",DATEDIF(D5,TODAY(),\"Y\"))","v":"Input DOB"}]
[null,null,"Estimate Retirement Age"]
[null,null,"Will the applicant share household with Applicant 1?"]
[]
[null,"Employment Income"]
[]
{"$rows_left_out":122}
{"sheet":"Applicant 3","index":4,"n_rows":131,"n_cols":9,"rows_kept":131,"cut":false,"hidden":true,"merged":[[2,1,2,9],[75,2,75,8],[81,2,81,8],[94,1,94,9],[125,1,125,9],[8,1,8,9],[35,1,35,9],[58,2,58,8],[64,2,64,8],[70,2,70,8],[57,1,57,9],[10,3,10,4]]}
[{"$f":"'Loan Details'!H5","v":"Broker"}]
[]
[null,"Loan Details"]
[]
[null,null,"Date of Birth (YYYY-MM-DD)",null,null,null,"Age",{"$f":"IF(D5=\"\",\"Input DOB\",DATEDIF(D5,TODAY(),\"Y\"))","v":"Input DOB"}]
[null,null,"Estimate Retirement Age"]
[null,null,"Will the applicant share household with Applicant 1?"]
[]
[null,"Employment Income"]
[]
{"$rows_left_out":122}
{"sheet":"Applicant 4","index":5,"n_rows":131,"n_cols":9,"rows_kept":131,"cut":false,"hidden":true,"merged":[[2,1,2,9],[75,2,75,8],[81,2,81,8],[94,1,94,9],[125,1,125,9],[8,1,8,9],[35,1,35,9],[58,2,58,8],[64,2,64,8],[70,2,70,8],[57,1,57,9],[10,3,10,4]]}
[{"$f":"'Loan Details'!H5","v":"Broker"}]
[]
[null,"Loan Details"]
[]
[null,null,"Date of Birth (YYYY-MM-DD)",null,null,null,"Age",{"$f":"IF(D5=\"\",\"Input DOB\",DATEDIF(D5,TODAY(),\"Y\"))","v":"Input DOB"}]
[null,null,"Estimate Retirement Age"]
[null,null,"Will the applicant share household with Applicant 1?"]
[]
[null,"Employment Income"]
[]
{"$rows_left_out":122}
{"sheet":"Household Expenditure","index":6,"n_rows":17,"n_cols":8,"rows_kept":17,"cut":false,"hidden":false,"merged":[[2,1,2,9]]}
[{"$f":"'Loan Details'!D12","v":0}]
[]
[null,"Household Expenditure - One Per Application"]
[]
[null,null,"Number of Applicants  in the same household",{"$f":"1+IF('Applicant 2'!D7=\"Yes\",1,0)+IF('Applicant 3'!D7=\"Yes\",1,0)+IF('Applicant 4'!D7=\"Yes\",1,0)","v":1},null,null,"Number of Other Applicants",{"$f":"Number_of_Applicants-'Household Expenditure'!D5","v":-1}]
[null,null,"Number of Dependants",{"$f":"Input!H16","v":0}]
[null,null,"Total Household",{"$f":"D5+D6","v":1}]
[]
[null,null,"Rates / Local authority charges",{"$f":"Input!D89","v":0}]
[null,null,"Rental Service Charge",{"$f":"Input!H12","v":0}]
{"$rows_left_out":8}
{"sheet":"Summary Calculations","index":7,"n_rows":42,"n_cols":8,"rows_kept":42,"cut":false,"hidden":false,"merged":[[2,1,2,9],[28,1,28,9],[35,1,35,9]]}
[]
[]
[null,"Total Income Calculation"]
[]
[null,null,"Total Gross Annual Income",{"$f":"'Applicant 1'!D128+'Applicant 2'!D128+'Applicant 3'!D128+'Applicant 4'!D128","v":0}]
[null,null,"Total Net Assessable Monthly Income",{"$f":"'Applicant 1'!D131+'Applicant 2'!D131+'Applicant 3'!D131+'Applicant 4'!D131","v":0}]
[]
[null,null,"Stressed Existing Mortgage / BTL Commitments",{"$f":"'Applicant 1'!H63+'Applicant 1'!H69+'Applicant 1'!H121+'Applicant 2'!H63+'Applicant 2'!H69+'Applicant 2'!H121+'Applicant 3'!H63+'Applicant 3'!H69+'Applicant 3'!H121+'Applicant 4'!H63+'Applicant 4'!H69+'Applicant 4'!H121","v":0}]
[null,null,"Existing Properties Associated Costs",{"$f":"'Applicant 1'!D122+'Applicant 2'!D122+'Applicant 3'!D122+'Applicant 4'!D122","v":0}]
[]
{"$rows_left_out":33}
{"sheet":"Version control","index":8,"n_rows":32,"n_cols":4,"rows_kept":32,"cut":false,"hidden":true,"merged":[]}
[]
["Version number","Date of change","Shortname","Brief description of change"]
["v7.3","2020-07-06","BMCG ","> created version control\n> changed DI ratio check in 'Rates' to 5% instead of 2.5%\n> Changed 'Applicant 1' and 'Applicant 2' where If either Applicant 1 or 2 have total gross income > 50k then child benefit is zero for both monthly and yearly figures "]
["v7.35","2020-07-06","BMCG ","> fixed the follow on mortgage payment if there is no follow on payment pulled through "]
["v7.4","2020-07-07","YSO","> added rates for higher LTV and remortgage for existing customers\n> added product Remortgage - Internal (Loan Details)"]
["v7.45","2020-07-07","YSO","> fixed term fields for Remortgage - Internal\n> child benefit is not calculated in totals for customers with gross income >50k. If Applicant 1 and Applicant 2 will be sharing household, their total Total gross income is calculated for this, otherwise only one applicant's income"]
["v7.46","2020-07-07","YSO","> Fixed Total deductions calculation on Tax sheets"]
["v7.5","2020-07-08","YSO","> Fixed Sensitivity calculation\n> Employment: Fixed Term Contract- the fields for salary input appear only if type of fixed term chosen\n> Fixed Zero hours assessable net income calculation\n> Fixed issue with rate not pulling through for LTV>94,5\n> Added Rental service charge to Debt Service Commitment with initial monthly Payment\n> Rental service charge field is updated not only when 'Reset Household' is pressed, but also when rates inputed  (couldn't find e better solution yet)"]
["v7.51","2020-07-08","YSO","Fixed interest rate input for SVR"]
["v7.55","2020-07-09","YSO","> Rental service charge field (household Expenditure) activates/deactivates when Coownership status changes\n> Income Earned as Partner or Sole Proprietor is included in self employed income for national insurance calculation\n> Other sources of income: If Direct and Self Employed / Employed and self employed, Net monthly fields are unavailable for input"]
{"$rows_left_out":23}
{"sheet":"Stress Rates","index":9,"n_rows":31,"n_cols":5,"rows_kept":31,"cut":false,"hidden":true,"merged":[[4,1,6,1],[4,4,6,4],[7,1,9,1],[7,4,9,4]]}
["7 New Mortgage Commitments"]
[]
[]
["New Product applied for ","Borrower Type","E1B07","Stress Rate Additional Borrowing","Stress Rate No Additional Borrowing "]
["Variable rate (BRT or SVR) Residential Mortgage, including self builds and additional variable rate RMCs.","Other than Re-Mortgage","All","Existing variable rate plus 3%","N/A"]
["2 or 3 year fixed rate residential mortgage /additional 2 and 3 year fixed rate RMCs",null,"All","Follow on (reversion) rate plus 3%"]
["5 year fixed rate residential mortgage / additional 5 year fixed RMCs",null,"All","No stress"]
["Variable rate (BRT or SVR) Residential Mortgage, including self builds and additional variable rate RMCs.","Re-Mortgage","All","Existing variable rate plus 3%","N/A (but to be built in for future use)"]
["2 or 3 year fixed rate residential mortgage /additional 2 and 3 year fixed rate RMCs",null,"All","Follow on (reversion) rate plus 3%"]
["5 year fixed rate residential mortgage / additional 5 year fixed RMCs",null,"All","No stress"]
{"$rows_left_out":22}
{"sheet":"CostOfLiving","index":10,"n_rows":20,"n_cols":11,"rows_kept":20,"cut":false,"hidden":true,"merged":[[1,9,1,10],[1,6,1,7],[1,3,1,5],[1,1,1,2]]}
[]
[null,"Model Details",null,"Polynomial Coefficients",null,null,"Power Curve Coefficients",null,"Dependant Increase Rate","Mangement Overlays"]
[null,"Model Name","Model Form","a2","a1","a0","c","m",null,"Floor","Ceiling"]
[null,"Danske 1 Adult 0 Dependant ","y = a2*x^2 + a1*a1 + a0",-6.173640628725404E-8,1.3469420101887199E-2,425.96645740292121,"N/A","N/A","N/A",505,1150]
[null,"Danske 2 Adult 0 Dependant ","y = c*x^m","N/A","N/A","N/A",8.4569786620158354,-0.32809036632335026,"N/A",850,1375]
[null,"Danske Additional Dependant cost ","y = #Dependants*(Expenditure 1 Adult 0 Dependan)*16.8% + Adult Expenditure","N/A","N/A","N/A","N/A","N/A",0.16800000000000001,"N/A","N/A"]
[]
[]
[null,"Number of Adults",{"$f":"MIN('Household Expenditure'!D5,2)","v":1}]
[null,"Number of Dependants",{"$f":"'Household Expenditure'!D6","v":0}]
{"$rows_left_out":11}
{"sheet":"Rates","index":11,"n_rows":48,"n_cols":17,"rows_kept":48,"cut":false,"hidden":true,"merged":[[2,2,2,5],[4,2,4,4],[4,5,29,5],[4,7,4,9],[4,10,29,10],[22,2,29,2],[22,7,29,7],[6,2,13,2],[6,7,13,7],[14,2,21,2],[14,7,21,7],[47,2,47,3],[35,2,35,6],[39,2,39,5],[41,2,46,2],[4,12,4,14],[6,12,13,12],[14,12,21,12],[22,12,29,12]]}
[null,null,null,null,"Purchase",null,null,null,null,"Remortgage",null,null,null,null,"Remortgage - Internal"]
[null,null,null,null,4,null,null,null,null,9,null,null,null,null,14]
[null,null,"Residential Fixed Rates"]
[]
[null,null,"Purchaser Rates \n(First Time Buyer & Home Mover)",null,null,"Min. Loan Amount (Mortgage): \n\n£30k+\n(£10k for Existing HL Customers)\n\nMin. Loan Amount (Additional Borrowing):\n\n£5k - (existing mortgage customer)\n£30k - (unencumbered property)",null,"Remortgager Rates \n(Switcher)",null,null,"Min. Loan Amount (Mortgage): \n\n£30k+\n(£10k for Existing HL Customers)\n\nMin. Loan Amount (Additional Borrowing):\n\n£5k - (existing mortgage customer)\n£30k - (unencumbered property)",null,"Existing Customers"]
[null,null,"Product","LTV Tier","Rate",null,null,"Product","LTV Tier","Rate",null,null,"Product","LTV Tier","Rate"]
["2 year fixed rate",0,"2 Yr Fixed Rates 'FeeSaver'\n","Up to 60%",1.7000000000000001E-2,null,null,"2 Yr Fixed Rates 'FeeSaver'\n","Up to 60%",1.4500000000000001E-2,null,null,"2 Yr Fixed Rates 'FeeSaver'\n","Up to 60%",1.4500000000000001E-2]
[null,0.60499999999999998,null,"61-70%",1.9599999999999999E-2,null,null,null,"61-70%",1.67E-2,null,null,null,"61-70%",1.7899999999999999E-2]
[null,0.70499999999999996,null,"71-75%",1.9599999999999999E-2,null,null,null,"71-75%",1.67E-2,null,null,null,"71-75%",1.7899999999999999E-2]
[null,0.755,null,"76-80%",2.3E-2,null,null,null,"76-80%",2.2800000000000001E-2,null,null,null,"76-80%",2.3099999999999999E-2]
{"$rows_left_out":39}
{"sheet":"Rates_upd","index":12,"n_rows":204,"n_cols":21,"rows_kept":204,"cut":false,"hidden":true,"merged":[[17,18,18,18],[17,5,17,12],[17,1,18,1],[17,2,18,2],[17,3,18,3],[17,16,18,16],[17,17,18,17]]}
[]
[null,"Product Type","Loan Purchase","Loan To Value","Term",null,null,null,null,null,null,null,null,null,null,null,"Product Type","Loan Purchase","Loan To Value"]
[null,"Normal","Purchase","Up to 60%","2 year",null,null,null,null,null,null,null,null,null,null,null,"Normal","Purchase","Up to 60%"]
[null,"Carbon Neutral","Remortgage","61-70%","3 year",null,null,null,null,null,null,null,null,null,null,null,"Carbon Neutral","Remortgage","61-80%"]
[null,null,"Remortgage - Internal","71-75%","5 year",null,null,null,null,null,null,null,null,null,null,null,null,"Remortgage - Internal","81-85%"]
[null,null,"Purchase - SO","76-80%",null,null,null,null,null,null,null,null,null,null,null,null,null,"Purchase - SO","86-90%"]
[null,null,"Remortgage - SO","81-85%",null,null,null,null,null,null,null,null,null,null,null,null,null,"Remortgage - SO","91-95%"]
[null,null,"Remortgage - Internal - SO","86-90%",null,null,null,null,null,null,null,null,null,null,null,null,null,"Remortgage - Internal - SO","Over 95%"]
[null,null,null,"91-95%"]
[null,null,null,"Over 95%"]
{"$rows_left_out":195}
{"sheet":"Tax Applicant 1","index":13,"n_rows":170,"n_cols":18,"rows_kept":170,"cut":false,"hidden":true,"merged":[]}
[null,"UK Taxation"]
[null,null," "]
[null,"Additional Deduction Fields"]
[null,"Age",{"$f":"'Applicant 1'!H5","v":31}," years"]
[null,"Student Loan Payment",{"$f":"IF('Applicant 1'!D91>0,\"Plan1\",\"No\")","v":"No"},"(Plan2/No)"]
[null,"Blind","No","(Yes/No)"]
[null,"Pension Contributions",{"$f":"'Applicant 1'!H86*12","v":0}," per year"]
[null,"Childcare Vouchers",{"$f":"'Applicant 1'!D87*12","v":0}," per year"]
[]
[null,"Income Type"]
{"$rows_left_out":161}
{"sheet":"Tax Applicant 2","index":14,"n_rows":170,"n_cols":18,"rows_kept":170,"cut":false,"hidden":true,"merged":[]}
[null,"UK Taxation"]
[null,null," "]
[null,"Additional Deduction Fields"]
[null,"Age",{"$f":"'Applicant 2'!H5","v":"Input DOB"}," years"]
[null,"Student Loan Payment",{"$f":"IF('Applicant 2'!D91>0,\"Plan2\",\"No\")","v":"No"},"(Plan2/No)"]
[null,"Blind","No","(Yes/No)"]
[null,"Pension Contributions",{"$f":"'Applicant 2'!H86*12","v":0}," per year"]
[null,"Childcare Vouchers",{"$f":"'Applicant 2'!D87*12","v":0}," per year"]
[]
[null,"Income Type"]
{"$rows_left_out":161}
{"sheet":"Tax Applicant 3","index":15,"n_rows":170,"n_cols":18,"rows_kept":170,"cut":false,"hidden":true,"merged":[]}
[null,"UK Taxation"]
[null,null," "]
[null,"Additional Deduction Fields"]
[null,"Age",{"$f":"'Applicant 3'!H5","v":"Input DOB"}," years"]
[null,"Student Loan Payment",{"$f":"IF('Applicant 3'!D91>0,\"Plan2\",\"No\")","v":"No"},"(Plan2/No)"]
[null,"Blind","No","(Yes/No)"]
[null,"Pension Contributions",{"$f":"'Applicant 3'!H86*12","v":0}," per year"]
[null,"Childcare Vouchers",{"$f":"'Applicant 3'!D87*12","v":0}," per year"]
[]
[null,"Income Type"]
{"$rows_left_out":161}
{"sheet":"Tax Applicant 4","index":16,"n_rows":170,"n_cols":18,"rows_kept":170,"cut":false,"hidden":true,"merged":[]}
[null,"UK Taxation"]
[null,null," "]
[null,"Additional Deduction Fields"]
[null,"Age",{"$f":"'Applicant 4'!H5","v":"Input DOB"}," years"]
[null,"Student Loan Payment",{"$f":"IF('Applicant 4'!D91>0,\"Plan2\",\"No\")","v":"No"},"(Plan2/No)"]
[null,"Blind","No","(Yes/No)"]
[null,"Pension Contributions",{"$f":"'Applicant 4'!H86*12","v":0}," per year"]
[null,"Childcare Vouchers",{"$f":"'Applicant 4'!D87*12","v":0}," per year"]
[]
[null,"Income Type"]
{"$rows_left_out":161}
{"sheet":"Tax Rates","index":17,"n_rows":90,"n_cols":5,"rows_kept":90,"cut":false,"hidden":true,"merged":[]}
[]
[]
["Personal Allowance"]
[null,"2021/22 Allowance","2020/21 Allowance"]
["Allowance",12570,12500,"per year"]
[]
["Interest Income "]
["Allowances ","2021/22 Allowance","2020/21 Allowance"]
["Starting Rate",5000,5000,"per year"]
["Basic Rate",1000,1000,"per year"]
{"$rows_left_out":81}
{"sheet":"1 Net Monthly Income","index":18,"n_rows":39,"n_cols":4,"rows_kept":39,"cut":false,"hidden":true,"merged":[[37,0,37,2],[3,0,3,3],[5,2,9,2],[6,3,8,3],[12,0,12,2],[14,2,16,2],[19,0,19,2]]}
["1 Net Monthly Income"]
[]
[]
["Employed Income"]
["Gross Income Type","Assessable Percentage","Recognised Income","Notes"]
["Basic Salary",1,"100% of Basic Salary \n+ \n50% of (Overtime + Commission + Bonus) \n+ \n100% of Permanent Contracted Allowances"]
["Overtime ",0.5,null,"discount may be subject to changes"]
["Commission",0.5]
["Bonus",0.5]
["Permant Contracted Allowances  ",1]
{"$rows_left_out":30}
{"sheet":"2 Existing Mortgage Commitments","index":19,"n_rows":20,"n_cols":7,"rows_kept":20,"cut":false,"hidden":true,"merged":[[8,0,9,0],[18,0,19,0]]}
["2 Existing Mortgage Commitments"]
[]
[]
["BTL Properties (BTLPortfolioMortgage)"]
["Should now be taken from the commitments screen not from the total BTL tab"]
[]
[]
[null,"To be repaid","Include within monthly commitments","Mortgage Commitment to be used ","Percent 1","Percent 2","Other Commitments"]
["Customer has BTL properties","Yes","No","Not needed",null,null,"Not Needed"]
[null,"No","Yes","MAXIMUM(Total Exisiting Mortgage Payment + (2% Of Total Outstanding Balance)/12, (5.50% Of Total Outstanding Balance)/12) ",0.02,5.5E-2,"Total Net Rent Received After Agent Fees (Total Monthly Additional Costs detailed on application form) of properties that are not to be repaid"]
{"$rows_left_out":11}
{"sheet":"3 Revolving Credit Commitments","index":20,"n_rows":35,"n_cols":4,"rows_kept":35,"cut":false,"hidden":true,"merged":[]}
["3 Revolving Credit Commitments"]
[]
[]
["Inputs","Variable"]
["Declared Total outstanding balance on Overdrafts/Store Cards/Credit Cards even if declared to be repaid","Declared Revolving Balances"]
["Declared Total outstanding balance on Overdrafts/Store Cards/Credit Cards that customer declares are to be repaid","Repaid Declared Revolving Balances"]
["Experian variable - SP-A-04 (Balance of active revolving CAIS) from both soft and hard search","SP-A-04"]
[]
["Rule","Logic"]
["Threshold check","IF ABS((Declared Revolving Balances/SP-A-04) -1) <= 0.05 THEN PASS\nELSE FAIL"]
{"$rows_left_out":25}