{"text_format":"1","workbook":"xlsx","n_sheets":3,"sheets":["Loan to Value","LPS","Tieried Rates"],"not_rendered":{"charts":0,"images":1,"macros":0,"external_links":1,"defined_names":0,"comments":0,"pivot_tables":0},"unopened":[],"bounds":{"document_bytes":16777216,"sheet_cells":100000,"rows_first":2000,"rows_last":500,"rows_between":2000,"halvings":0,"cell_chars":16384,"cell_head_chars":4096},"cells_cut":0,"cells_raw":0,"read":"whole","date_system":"1900"}

{"sheet":"Loan to Value","index":0,"n_rows":17,"n_cols":16,"rows_kept":17,"cut":false,"hidden":false,"merged":[[2,2,2,6],[2,8,2,12],[14,8,15,12],[16,2,16,6],[16,8,16,12],[10,11,10,12],[11,11,11,12],[12,11,12,12]]}
[]
[]
[null,null,"PROPERTY VALUATION",null,null,null,null,null,"Loan to Value % Calculator"]
[]
[null,null,null,"Enter Postcode ",null,null,null,null,null,"Value of Property"]
[null,null,null,null,null,null,null,null,null,null,null,null,null,null,"Display","Bands"]
[null,null,null,"Enter LPS Property Value",null,null,null,null,null,"Total Loan amount required*",null,null,null,null,"Up to 60%",0.60494999999999999]
[null,null,null,null,null,null,null,null,null,null,null,null,null,null,"61% up to 80%",0.80495000000000005]
[null,null,null,"Multiplier ",null,{"$f":"VLOOKUP(F5,LPS!B1:D96,3,0)","v":{"$error":"#N/A"}},null,null,null,"Loan to Value %",null,{"$f":"ROUND(L7/L5,2)","v":{"$error":"#DIV/0!"}},null,null,"81% up to 85%",0.85494999999999999]
[null,null,null,null,null,null,null,null,null,null,null,null,null,null,"86% up to 90%",0.90495000000000003]
[null,null,null,"Today's Approx Valuation ",null,{"$f":"F7+(F9*F7)","v":{"$error":"#N/A"}},null,null,null,"Min Property Value for BRT Tier",null,"Min Property Value for Fixed Rate Tier",null,null,"91% up to 95%",0.95]
[null,null,null,null,null,null,null,null,null,{"$f":"INDEX('Tieried Rates'!$H$2:$H$7,MATCH('Loan to Value'!$L$9,'Tieried Rates'!$G$2:$G$7,1))","v":{"$error":"#DIV/0!"}},null,{"$f":"INDEX('Tieried Rates'!$K$2:$K$8,MATCH('Loan to Value'!$L$9,'Tieried Rates'!$J$2:$J$8,1))","v":{"$error":"#DIV/0!"}}]
[null,null,null,null,null,null,null,null,null,{"$f":"IF(L7/J12>L5,L5,L7/J12)","v":{"$error":"#DIV/0!"}},null,{"$f":"IF(L7/L12>L5,L5,L7/L12)","v":{"$error":"#DIV/0!"}}]
[null,null,null,null,null,null,null,null,null,null,null,null,null,null,"LTV Too High"]
[null,null,null,null,null,null,null,null,"*Total loan amount should include any existing and new borrowing to be secured on the property.\n** Value to be keyed into CAT under the Loan Illustration section\n*** For Danske Repay, Self Build Home Loans and for any Investment Property Loans, Please use the Estimated Value for the Min Property Value in CAT"]
[]
[null,null,"Click here to open the \nLand and Property Services (LPS) Database",null,null,null,null,null,"Pricing Information:\nThe Loan to Value % is rounded to the nearest whole number in order to identify the appropriate margin i.e. a LTV of '60.49%' is rounded down to 60% LTV & a LTV of '60.50%' is rounded up to 61% LTV."]

{"sheet":"LPS","index":1,"n_rows":84,"n_cols":4,"rows_kept":84,"cut":false,"hidden":false,"merged":[]}
["Region","Postcode","Area","Multiplier"]
[1,"BT29","Antrim and Newtownabbey ",0.26979999999999998]
[1,"BT36","Antrim and Newtownabbey ",0.26979999999999998]
[1,"BT37","Antrim and Newtownabbey ",0.26979999999999998]
[1,"BT41","Antrim and Newtownabbey ",0.26979999999999998]
[2,"BT18","Ards and North Down ",0.2074]
[2,"BT19","Ards and North Down ",0.2074]
[2,"BT20","Ards and North Down ",0.2074]
[2,"BT21","Ards and North Down ",0.2074]
[2,"BT22","Ards and North Down ",0.2074]
[2,"BT23","Ards and North Down ",0.2074]
[3,"BT25","Armagh City, Banbridge and Craigavon",0.24049999999999999]
[3,"BT32","Armagh City, Banbridge and Craigavon",0.24049999999999999]
[3,"BT60","Armagh City, Banbridge and Craigavon",0.24049999999999999]
[3,"BT61","Armagh City, Banbridge and Craigavon",0.24049999999999999]
[3,"BT62","Armagh City, Banbridge and Craigavon",0.24049999999999999]
[3,"BT63","Armagh City, Banbridge and Craigavon",0.24049999999999999]
[3,"BT64","Armagh City, Banbridge and Craigavon",0.24049999999999999]
[3,"BT65","Armagh City, Banbridge and Craigavon",0.24049999999999999]
[3,"BT66","Armagh City, Banbridge and Craigavon",0.24049999999999999]
[3,"BT67","Armagh City, Banbridge and Craigavon",0.24049999999999999]
[4,"BT1","Belfast ",0.27510000000000001]
[4,"BT2","Belfast ",0.27510000000000001]
[4,"BT3","Belfast ",0.27510000000000001]
[4,"BT4","Belfast ",0.27510000000000001]
[4,"BT7","Belfast ",0.27510000000000001]
[4,"BT8","Belfast ",0.27510000000000001]
[4,"BT9","Belfast ",0.27510000000000001]
[4,"BT10","Belfast ",0.27510000000000001]
[4,"BT11","Belfast ",0.27510000000000001]
[4,"BT12","Belfast ",0.27510000000000001]
[4,"BT13","Belfast ",0.27510000000000001]
[4,"BT14","Belfast ",0.27510000000000001]
[4,"BT15","Belfast ",0.27510000000000001]
[4,"BT17","Belfast ",0.27510000000000001]
[5,"BT49","Causeway Coast and Glens ",0.2349]
[5,"BT51","Causeway Coast and Glens ",0.2349]
[5,"BT52","Causeway Coast and Glens ",0.2349]
[5,"BT53","Causeway Coast and Glens ",0.2349]
[5,"BT54","Causeway Coast and Glens ",0.2349]
[5,"BT55","Causeway Coast and Glens ",0.2349]
[5,"BT56","Causeway Coast and Glens ",0.2349]
[5,"BT57","Causeway Coast and Glens ",0.2349]
[6,"BT47","Derry City and Strabane ",0.27379999999999999]
[6,"BT48","Derry City and Strabane ",0.27379999999999999]
[6,"BT81","Derry City and Strabane ",0.27379999999999999]
[6,"BT82","Derry City and Strabane ",0.27379999999999999]
[7,"BT74","Fermanagh and Omagh ",0.25490000000000002]
[7,"BT78","Fermanagh and Omagh ",0.25490000000000002]
[7,"BT79","Fermanagh and Omagh ",0.25490000000000002]
[7,"BT92","Fermanagh and Omagh ",0.25490000000000002]
[7,"BT93","Fermanagh and Omagh ",0.25490000000000002]
[7,"BT94","Fermanagh and Omagh ",0.25490000000000002]
[8,"BT5","Lisburn and Castlereagh ",0.29270000000000002]
[8,"BT6","Lisburn and Castlereagh ",0.29270000000000002]
[8,"BT16","Lisburn and Castlereagh ",0.29270000000000002]
[8,"BT26","Lisburn and Castlereagh ",0.29270000000000002]
[8,"BT27","Lisburn and Castlereagh ",0.29270000000000002]
[8,"BT28","Lisburn and Castlereagh ",0.29270000000000002]
[9,"BT38","Mid and East Antrim ",0.22239999999999999]
[9,"BT39","Mid and East Antrim ",0.22239999999999999]
[9,"BT40","Mid and East Antrim ",0.22239999999999999]
[9,"BT42","Mid and East Antrim ",0.22239999999999999]
[9,"BT43","Mid and East Antrim ",0.22239999999999999]
[9,"BT44","Mid and East Antrim ",0.22239999999999999]
[10,"BT45","Mid Ulster ",0.18659999999999999]
[10,"BT46","Mid Ulster ",0.18659999999999999]
[10,"BT68","Mid Ulster ",0.18659999999999999]
[10,"BT69","Mid Ulster ",0.18659999999999999]
[10,"BT70","Mid Ulster ",0.18659999999999999]
[10,"BT71","Mid Ulster ",0.18659999999999999]
[10,"BT75","Mid Ulster ",0.18659999999999999]
[10,"BT76","Mid Ulster ",0.18659999999999999]
[10,"BT77","Mid Ulster ",0.18659999999999999]
[10,"BT80","Mid Ulster ",0.18659999999999999]
[11,"BT24","Newry, Mourne and Down ",0.29799999999999999]
[11,"BT30","Newry, Mourne and Down ",0.29799999999999999]
[11,"BT31","Newry, Mourne and Down ",0.29799999999999999]
[11,"BT33","Newry, Mourne and Down ",0.29799999999999999]
[11,"BT34","Newry, Mourne and Down ",0.29799999999999999]
[11,"BT35","Newry, Mourne and Down ",0.29799999999999999]
[12,"BT50","Northern Ireland all",0.25600000000000001]
[12,"BT72","Northern Ireland all",0.25600000000000001]
[12,"BT73","Northern Ireland all",0.25600000000000001]

{"sheet":"Tieried Rates","index":2,"n_rows":855,"n_cols":11,"rows_kept":855,"cut":false,"hidden":true,"merged":[]}
["BRT Tiering","Top Rate Band",null,"VR Tiering","Top Rate Band",null,"BRT Tiering","Top Rate Band",null,"FR Tiering","Top Rate Band"]
[0.10100000000000001,0.6,null,0.10100000000000001,0.6,null,0,0.6,null,0,0.6]
[0.10199999999999999,0.6,null,0.10199999999999999,0.6,null,0.60499999999999998,0.8,null,0.60499999999999998,0.7]
[0.10299999999999999,0.6,null,0.10299999999999999,0.6,null,0.80500000000000005,0.85,null,0.70499999999999996,0.75]
[0.104,0.6,null,0.104,0.6,null,0.85499999999999998,0.9,null,0.755,0.8]
[0.105,0.6,null,0.105,0.6,null,0.90500000000000003,0.95,null,0.80500000000000005,0.85]
[0.106,0.6,null,0.106,0.6,null,9.9990000000000006,0.95,null,0.85499999999999998,0.9]
[0.107,0.6,null,0.107,0.6,null,null,null,null,0.90500000000000003,0.95]
[0.108,0.6,null,0.108,0.6]
[0.109,0.6,null,0.109,0.6]
[0.11,0.6,null,0.11,0.6]
[0.111,0.6,null,0.111,0.6]
[0.112,0.6,null,0.112,0.6]
[0.113,0.6,null,0.113,0.6]
[0.114,0.6,null,0.114,0.6]
[0.115,0.6,null,0.115,0.6]
[0.11600000000000001,0.6,null,0.11600000000000001,0.6]
[0.11700000000000001,0.6,null,0.11700000000000001,0.6]
[0.11799999999999999,0.6,null,0.11799999999999999,0.6]
[0.11899999999999999,0.6,null,0.11899999999999999,0.6]
[0.12,0.6,null,0.12,0.6]
[0.121,0.6,null,0.121,0.6]
[0.122,0.6,null,0.122,0.6]
[0.123,0.6,null,0.123,0.6]
[0.124,0.6,null,0.124,0.6]
[0.125,0.6,null,0.125,0.6]
[0.126,0.6,null,0.126,0.6]
[0.127,0.6,null,0.127,0.6]
[0.128,0.6,null,0.128,0.6]
[0.129,0.6,null,0.129,0.6]
[0.13,0.6,null,0.13,0.6]
[0.13100000000000001,0.6,null,0.13100000000000001,0.6]
[0.13200000000000001,0.6,null,0.13200000000000001,0.6]
[0.13300000000000001,0.6,null,0.13300000000000001,0.6]
[0.13400000000000001,0.6,null,0.13400000000000001,0.6]
[0.13500000000000001,0.6,null,0.13500000000000001,0.6]
[0.13600000000000001,0.6,null,0.13600000000000001,0.6]
[0.13700000000000001,0.6,null,0.13700000000000001,0.6]
[0.13800000000000001,0.6,null,0.13800000000000001,0.6]
[0.13900000000000001,0.6,null,0.13900000000000001,0.6]
[0.14000000000000001,0.6,null,0.14000000000000001,0.6]
[0.14099999999999999,0.6,null,0.14099999999999999,0.6]
[0.14199999999999999,0.6,null,0.14199999999999999,0.6]
[0.14299999999999999,0.6,null,0.14299999999999999,0.6]
[0.14399999999999999,0.6,null,0.14399999999999999,0.6]
[0.14499999999999999,0.6,null,0.14499999999999999,0.6]
[0.14599999999999999,0.6,null,0.14599999999999999,0.6]
[0.14699999999999999,0.6,null,0.14699999999999999,0.6]
[0.14799999999999999,0.6,null,0.14799999999999999,0.6]
[0.14899999999999999,0.6,null,0.14899999999999999,0.6]
[0.15,0.6,null,0.15,0.6]
[0.151,0.6,null,0.151,0.6]
[0.152,0.6,null,0.152,0.6]
[0.153,0.6,null,0.153,0.6]
[0.154,0.6,null,0.154,0.6]
[0.155,0.6,null,0.155,0.6]
[0.156,0.6,null,0.156,0.6]
[0.157,0.6,null,0.157,0.6]
[0.158,0.6,null,0.158,0.6]
[0.159,0.6,null,0.159,0.6]
[0.16,0.6,null,0.16,0.6]
[0.161,0.6,null,0.161,0.6]
[0.16200000000000001,0.6,null,0.16200000000000001,0.6]
[0.16300000000000001,0.6,null,0.16300000000000001,0.6]
[0.16400000000000001,0.6,null,0.16400000000000001,0.6]
[0.16500000000000001,0.6,null,0.16500000000000001,0.6]
[0.16600000000000001,0.6,null,0.16600000000000001,0.6]
[0.16700000000000001,0.6,null,0.16700000000000001,0.6]
[0.16800000000000001,0.6,null,0.16800000000000001,0.6]
[0.16900000000000001,0.6,null,0.16900000000000001,0.6]
[0.17,0.6,null,0.17,0.6]
[0.17100000000000001,0.6,null,0.17100000000000001,0.6]
[0.17199999999999999,0.6,null,0.17199999999999999,0.6]
[0.17299999999999999,0.6,null,0.17299999999999999,0.6]
[0.17399999999999999,0.6,null,0.17399999999999999,0.6]
[0.17499999999999999,0.6,null,0.17499999999999999,0.6]
[0.17599999999999999,0.6,null,0.17599999999999999,0.6]
[0.17699999999999999,0.6,null,0.17699999999999999,0.6]
[0.17799999999999999,0.6,null,0.17799999999999999,0.6]
[0.17899999999999999,0.6,null,0.17899999999999999,0.6]
[0.18,0.6,null,0.18,0.6]
[0.18099999999999999,0.6,null,0.18099999999999999,0.6]
[0.182,0.6,null,0.182,0.6]
[0.183,0.6,null,0.183,0.6]
[0.184,0.6,null,0.184,0.6]
[0.185,0.6,null,0.185,0.6]
[0.186,0.6,null,0.186,0.6]
[0.187,0.6,null,0.187,0.6]
[0.188,0.6,null,0.188,0.6]
[0.189,0.6,null,0.189,0.6]
[0.19,0.6,null,0.19,0.6]
[0.191,0.6,null,0.191,0.6]
[0.192,0.6,null,0.192,0.6]
[0.193,0.6,null,0.193,0.6]
[0.19400000000000001,0.6,null,0.19400000000000001,0.6]
[0.19500000000000001,0.6,null,0.19500000000000001,0.6]
[0.19600000000000001,0.6,null,0.19600000000000001,0.6]
[0.19700000000000001,0.6,null,0.19700000000000001,0.6]
[0.19800000000000001,0.6,null,0.19800000000000001,0.6]
[0.19900000000000001,0.6,null,0.19900000000000001,0.6]
[0.2,0.6,null,0.2,0.6]
[0.20100000000000001,0.6,null,0.20100000000000001,0.6]
[0.20200000000000001,0.6,null,0.20200000000000001,0.6]
[0.20300000000000001,0.6,null,0.20300000000000001,0.6]
[0.20399999999999999,0.6,null,0.20399999999999999,0.6]
[0.20499999999999999,0.6,null,0.20499999999999999,0.6]
[0.20599999999999999,0.6,null,0.20599999999999999,0.6]
[0.20699999999999999,0.6,null,0.20699999999999999,0.6]
[0.20799999999999999,0.6,null,0.20799999999999999,0.6]
[0.20899999999999999,0.6,null,0.20899999999999999,0.6]
[0.21,0.6,null,0.21,0.6]
[0.21099999999999999,0.6,null,0.21099999999999999,0.6]
[0.21199999999999999,0.6,null,0.21199999999999999,0.6]
[0.21299999999999999,0.6,null,0.21299999999999999,0.6]
[0.214,0.6,null,0.214,0.6]
[0.215,0.6,null,0.215,0.6]
[0.216,0.6,null,0.216,0.6]
[0.217,0.6,null,0.217,0.6]
[0.218,0.6,null,0.218,0.6]
[0.219,0.6,null,0.219,0.6]
[0.22,0.6,null,0.22,0.6]
[0.221,0.6,null,0.221,0.6]
[0.222,0.6,null,0.222,0.6]
[0.223,0.6,null,0.223,0.6]
[0.224,0.6,null,0.224,0.6]
[0.22500000000000001,0.6,null,0.22500000000000001,0.6]
[0.22600000000000001,0.6,null,0.22600000000000001,0.6]
[0.22700000000000001,0.6,null,0.22700000000000001,0.6]
[0.22800000000000001,0.6,null,0.22800000000000001,0.6]
[0.22900000000000001,0.6,null,0.22900000000000001,0.6]
[0.23,0.6,null,0.23,0.6]
[0.23100000000000001,0.6,null,0.23100000000000001,0.6]
[0.23200000000000001,0.6,null,0.23200000000000001,0.6]
[0.23300000000000001,0.6,null,0.23300000000000001,0.6]
[0.23400000000000001,0.6,null,0.23400000000000001,0.6]
[0.23499999999999999,0.6,null,0.23499999999999999,0.6]
[0.23599999999999999,0.6,null,0.23599999999999999,0.6]
[0.23699999999999999,0.6,null,0.23699999999999999,0.6]
[0.23799999999999999,0.6,null,0.23799999999999999,0.6]
[0.23899999999999999,0.6,null,0.23899999999999999,0.6]
[0.24,0.6,null,0.24,0.6]
[0.24099999999999999,0.6,null,0.24099999999999999,0.6]
[0.24199999999999999,0.6,null,0.24199999999999999,0.6]
[0.24299999999999999,0.6,null,0.24299999999999999,0.6]
[0.24399999999999999,0.6,null,0.24399999999999999,0.6]
[0.245,0.6,null,0.245,0.6]
[0.246,0.6,null,0.246,0.6]
[0.247,0.6,null,0.247,0.6]
[0.248,0.6,null,0.248,0.6]
[0.249,0.6,null,0.249,0.6]
[0.25,0.6,null,0.25,0.6]
[0.251,0.6,null,0.251,0.6]
[0.252,0.6,null,0.252,0.6]
[0.253,0.6,null,0.253,0.6]
[0.254,0.6,null,0.254,0.6]
[0.255,0.6,null,0.255,0.6]
[0.25600000000000001,0.6,null,0.25600000000000001,0.6]
[0.25700000000000001,0.6,null,0.25700000000000001,0.6]
[0.25800000000000001,0.6,null,0.25800000000000001,0.6]
[0.25900000000000001,0.6,null,0.25900000000000001,0.6]
[0.26,0.6,null,0.26,0.6]
[0.26100000000000001,0.6,null,0.26100000000000001,0.6]
[0.26200000000000001,0.6,null,0.26200000000000001,0.6]
[0.26300000000000001,0.6,null,0.26300000000000001,0.6]
[0.26400000000000001,0.6,null,0.26400000000000001,0.6]
[0.26500000000000001,0.6,null,0.26500000000000001,0.6]
[0.26600000000000001,0.6,null,0.26600000000000001,0.6]
[0.26700000000000002,0.6,null,0.26700000000000002,0.6]
[0.26800000000000002,0.6,null,0.26800000000000002,0.6]
[0.26900000000000002,0.6,null,0.26900000000000002,0.6]
[0.27,0.6,null,0.27,0.6]
[0.27100000000000002,0.6,null,0.27100000000000002,0.6]
[0.27200000000000002,0.6,null,0.27200000000000002,0.6]
[0.27300000000000002,0.6,null,0.27300000000000002,0.6]
[0.27400000000000002,0.6,null,0.27400000000000002,0.6]
[0.27500000000000002,0.6,null,0.27500000000000002,0.6]
[0.27600000000000002,0.6,null,0.27600000000000002,0.6]
[0.27700000000000002,0.6,null,0.27700000000000002,0.6]
[0.27800000000000002,0.6,null,0.27800000000000002,0.6]
[0.27900000000000003,0.6,null,0.27900000000000003,0.6]
[0.28000000000000003,0.6,null,0.28000000000000003,0.6]
[0.28100000000000003,0.6,null,0.28100000000000003,0.6]
[0.28199999999999997,0.6,null,0.28199999999999997,0.6]
[0.28299999999999997,0.6,null,0.28299999999999997,0.6]
[0.28399999999999997,0.6,null,0.28399999999999997,0.6]
[0.28499999999999998,0.6,null,0.28499999999999998,0.6]
[0.28599999999999998,0.6,null,0.28599999999999998,0.6]
[0.28699999999999998,0.6,null,0.28699999999999998,0.6]
[0.28799999999999998,0.6,null,0.28799999999999998,0.6]
[0.28899999999999998,0.6,null,0.28899999999999998,0.6]
[0.28999999999999998,0.6,null,0.28999999999999998,0.6]
[0.29099999999999998,0.6,null,0.29099999999999998,0.6]
[0.29199999999999998,0.6,null,0.29199999999999998,0.6]
[0.29299999999999998,0.6,null,0.29299999999999998,0.6]
[0.29399999999999998,0.6,null,0.29399999999999998,0.6]
[0.29499999999999998,0.6,null,0.29499999999999998,0.6]
[0.29599999999999999,0.6,null,0.29599999999999999,0.6]
[0.29699999999999999,0.6,null,0.29699999999999999,0.6]
[0.29799999999999999,0.6,null,0.29799999999999999,0.6]
[0.29899999999999999,0.6,null,0.29899999999999999,0.6]
{"$rows_left_out":655}